Ask Your Question

Revision history [back]

click to hide/show revision 1
initial version

Failed to find spec for tdbgtracer37. What have I got wrong??

ImportError: Failed to find spec for tdbgtracer37 Failed to find spec for tdbgtracer37_x64 While trying to load 'tdbgtracer37_x64' from 'c:\program files (x86)\wing ide personal 6.1\bin\dbg\src\debug\tserver' Traceback (most recent call last): File "C:\Program Files (x86)\Wing IDE Personal 6.1\bin\dbg\src\debug\tserver\findmodules.py", line 224, in _FindTracer File "C:\Program Files (x86)\Wing IDE Personal 6.1\bin\dbg\src\debug\tserver\findmodules.py", line 325, in _LoadModule ImportError: Failed to find spec for tdbgtracer37_x64 Failed to find spec for tdbgtracer37_x64 While trying to load 'tdbgtracer37_x64' from 'c:\program files (x86)\wing ide personal 6.1\src\debug\tserver' Traceback (most recent call last): File "C:\Program Files (x86)\Wing IDE Personal 6.1\bin\dbg\src\debug\tserver\findmodules.py", line 224, in _FindTracer File "C:\Program Files (x86)\Wing IDE Personal 6.1\bin\dbg\src\debug\tserver\findmodules.py", line 325, in _LoadModule ImportError: Failed to find spec for tdbgtracer37_x64 dbgtracer=<module 'tdbgtracer_x64'="" from="" 'c:\\program="" files="" (x86)\\wing="" ide="" personal="" 6.1\\bin\\dbg\\src\\debug\\tserver\\tdbgtracer_x64.pyd'=""> 3.7.1 (v3.7.1:260ec2c36a, Oct 20 2018, 14:57:15) [MSC v.1915 64 bit (AMD64)]

Failed to find spec for tdbgtracer37. What have I got wrong??

ImportError: Failed to find spec for tdbgtracer37 Failed to find spec for tdbgtracer37_x64 Failed to find spec for tdbgtracer37_x64 While trying to load 'tdbgtracer37_x64' from 'c:\program files (x86)\wing ide personal 6.1\bin\dbg\src\debug\tserver' Traceback (most recent call last): File "C:\Program Files (x86)\Wing IDE Personal 6.1\bin\dbg\src\debug\tserver\findmodules.py", line 224, in _FindTracer File "C:\Program Files (x86)\Wing IDE Personal 6.1\bin\dbg\src\debug\tserver\findmodules.py", line 325, in _LoadModule ImportError: Failed to find spec for tdbgtracer37_x64 Failed to find spec for tdbgtracer37_x64 Failed to find spec for tdbgtracer37_x64 While trying to load 'tdbgtracer37_x64' from 'c:\program files (x86)\wing ide personal 6.1\src\debug\tserver' Traceback (most recent call last): File "C:\Program Files (x86)\Wing IDE Personal 6.1\bin\dbg\src\debug\tserver\findmodules.py", line 224, in _FindTracer File "C:\Program Files (x86)\Wing IDE Personal 6.1\bin\dbg\src\debug\tserver\findmodules.py", line 325, in _LoadModule ImportError: Failed to find spec for tdbgtracer37_x64 dbgtracer=<module 'tdbgtracer_x64'="" from="" 'c:\\program="" files="" (x86)\\wing="" ide="" personal="" 6.1\\bin\\dbg\\src\\debug\\tserver\\tdbgtracer_x64.pyd'=""> 3.7.1 (v3.7.1:260ec2c36a, Oct 20 2018, 14:57:15) [MSC v.1915 64 bit (AMD64)]

Failed to find spec for tdbgtracer37. What have I got wrong??

ImportError: Failed to find spec for tdbgtracer37 Failed to find spec for tdbgtracer37_x64 Failed to find spec for tdbgtracer37_x64 While trying to load 'tdbgtracer37_x64' from 'c:\program files (x86)\wing ide personal 6.1\bin\dbg\src\debug\tserver' Traceback (most recent call last): File "C:\Program Files (x86)\Wing IDE Personal 6.1\bin\dbg\src\debug\tserver\findmodules.py", line 224, in _FindTracer File "C:\Program Files (x86)\Wing IDE Personal 6.1\bin\dbg\src\debug\tserver\findmodules.py", line 325, in _LoadModule ImportError: Failed to find spec for tdbgtracer37_x64 Failed to find spec for tdbgtracer37_x64 Failed to find spec for tdbgtracer37_x64 While trying to load 'tdbgtracer37_x64' from 'c:\program files (x86)\wing ide personal 6.1\src\debug\tserver' Traceback (most recent call last): File "C:\Program Files (x86)\Wing IDE Personal 6.1\bin\dbg\src\debug\tserver\findmodules.py", line 224, in _FindTracer File "C:\Program Files (x86)\Wing IDE Personal 6.1\bin\dbg\src\debug\tserver\findmodules.py", line 325, in _LoadModule ImportError: Failed to find spec for tdbgtracer37_x64 dbgtracer=<module 'tdbgtracer_x64'="" from="" 'c:\\program="" files="" (x86)\\wing="" ide="" personal="" 6.1\\bin\\dbg\\src\\debug\\tserver\\tdbgtracer_x64.pyd'=""> 3.7.1 (v3.7.1:260ec2c36a, Oct 20 2018, 14:57:15) [MSC v.1915 64 bit (AMD64)]

Failed to find spec for tdbgtracer37. What have I got wrong??

Error message:

 ImportError: Failed to find spec for tdbgtracer37
        Failed to find spec for tdbgtracer37_x64
        While trying to load 'tdbgtracer37_x64' from 'c:\program 'c:\\program files (x86)\wing (x86)\\wing ide personal 6.1\bin\dbg\src\debug\tserver'
6.1\\bin\\dbg\\src\\debug\\tserver'
        Traceback (most recent call last):
          File "C:\Program Files (x86)\Wing IDE Personal 6.1\bin\dbg\src\debug\tserver\findmodules.py", line 224, in _FindTracer
          File "C:\Program Files (x86)\Wing IDE Personal 6.1\bin\dbg\src\debug\tserver\findmodules.py", line 325, in _LoadModule
        ImportError: Failed to find spec for tdbgtracer37_x64
        Failed to find spec for tdbgtracer37_x64
        While trying to load 'tdbgtracer37_x64' from 'c:\program 'c:\\program files (x86)\wing (x86)\\wing ide personal 6.1\src\debug\tserver'
6.1\\src\\debug\\tserver'
        Traceback (most recent call last):
          File "C:\Program Files (x86)\Wing IDE Personal 6.1\bin\dbg\src\debug\tserver\findmodules.py", line 224, in _FindTracer
          File "C:\Program Files (x86)\Wing IDE Personal 6.1\bin\dbg\src\debug\tserver\findmodules.py", line 325, in _LoadModule
        ImportError: Failed to find spec for tdbgtracer37_x64
        dbgtracer=<module 'tdbgtracer_x64'="" from="" 'c:\\program="" files="" (x86)\\wing="" ide="" personal="" 6.1\\bin\\dbg\\src\\debug\\tserver\\tdbgtracer_x64.pyd'="">
'tdbgtracer_x64' from 'c:\\program files (x86)\\wing ide personal 6.1\\bin\\dbg\\src\\debug\\tserver\\tdbgtracer_x64.pyd'>
        3.7.1 (v3.7.1:260ec2c36a, Oct 20 2018, 14:57:15) [MSC v.1915 64 bit (AMD64)]

(AMD64)]

Failed to find spec for tdbgtracer37. What have I got wrong??

Error message:

 ImportError: Failed to find spec for tdbgtracer37
 Failed to find spec for tdbgtracer37_x64
 While trying to load 'tdbgtracer37_x64' from 'c:\\program files (x86)\\wing ide personal 6.1\\bin\\dbg\\src\\debug\\tserver'
 Traceback (most recent call last):
   File "C:\Program Files (x86)\Wing IDE Personal 6.1\bin\dbg\src\debug\tserver\findmodules.py", line 224, in _FindTracer
   File "C:\Program Files (x86)\Wing IDE Personal 6.1\bin\dbg\src\debug\tserver\findmodules.py", line 325, in _LoadModule
 ImportError: Failed to find spec for tdbgtracer37_x64
 Failed to find spec for tdbgtracer37_x64
 While trying to load 'tdbgtracer37_x64' from 'c:\\program files (x86)\\wing ide personal 6.1\\src\\debug\\tserver'
 Traceback (most recent call last):
   File "C:\Program Files (x86)\Wing IDE Personal 6.1\bin\dbg\src\debug\tserver\findmodules.py", line 224, in _FindTracer
   File "C:\Program Files (x86)\Wing IDE Personal 6.1\bin\dbg\src\debug\tserver\findmodules.py", line 325, in _LoadModule
 ImportError: Failed to find spec for tdbgtracer37_x64
 dbgtracer=<module 'tdbgtracer_x64' from 'c:\\program files (x86)\\wing ide personal 6.1\\bin\\dbg\\src\\debug\\tserver\\tdbgtracer_x64.pyd'>
 3.7.1 (v3.7.1:260ec2c36a, Oct 20 2018, 14:57:15) [MSC v.1915 64 bit (AMD64)]

Failed to find spec for tdbgtracer37. What have I got wrong??

Error message:

ImportError: Failed to find spec for tdbgtracer37
Failed to find spec for tdbgtracer37_x64
While trying to load 'tdbgtracer37_x64' from 'c:\\program files (x86)\\wing ide personal 6.1\\bin\\dbg\\src\\debug\\tserver'
Traceback (most recent call last):
  File "C:\Program Files (x86)\Wing IDE Personal 6.1\bin\dbg\src\debug\tserver\findmodules.py", line 224, in _FindTracer
  File "C:\Program Files (x86)\Wing IDE Personal 6.1\bin\dbg\src\debug\tserver\findmodules.py", line 325, in _LoadModule
ImportError: Failed to find spec for tdbgtracer37_x64
Failed to find spec for tdbgtracer37_x64
While trying to load 'tdbgtracer37_x64' from 'c:\\program files (x86)\\wing ide personal 6.1\\src\\debug\\tserver'
Traceback (most recent call last):
  File "C:\Program Files (x86)\Wing IDE Personal 6.1\bin\dbg\src\debug\tserver\findmodules.py", line 224, in _FindTracer
  File "C:\Program Files (x86)\Wing IDE Personal 6.1\bin\dbg\src\debug\tserver\findmodules.py", line 325, in _LoadModule
ImportError: Failed to find spec for tdbgtracer37_x64
dbgtracer=<module 'tdbgtracer_x64' from 'c:\\program files (x86)\\wing ide personal 6.1\\bin\\dbg\\src\\debug\\tserver\\tdbgtracer_x64.pyd'>
3.7.1 (v3.7.1:260ec2c36a, Oct 20 2018, 14:57:15) [MSC v.1915 64 bit (AMD64)]